Reaction Details
TargetRetinoic acid receptor RXR-alpha
LigandBDBM50388545
Substrate/Competitorn/a
Meas. Tech.ChEMBL_940885 (CHEMBL2330504)
EC50 15900±n/a nM
Citation Conda-Sheridan, MPark, EJBeck, DEReddy, PVNguyen, TXHu, BChen, LWhite, JJvan Breemen, RBPezzuto, JMCushman, M Design, synthesis, and biological evaluation of indenoisoquinoline rexinoids with chemopreventive potential. J Med Chem56:2581-605 (2013) 
 
Retinoic acid receptor RXR-alpha
Name:Retinoic acid receptor RXR-alpha
Type:PROTEIN
Mol. Mass.:50820.38
Organism:Homo sapiens (Human)
Description:ChEMBL_1456363
Residue:462
BDBM50388545
NameBDBM50388545
Synonyms:CHEMBL1181674 | CHEMBL188130
TypeSmall organic molecule
Emp. Form.C18H14N2O2
Mol. Mass.290.316
SMILESNCCn1c2-c3ccccc3C(=O)c2c2ccccc2c1=O