Reaction Details
TargetRetinoic acid receptor RXR-alpha
LigandBDBM50396234
Substrate/Competitorn/a
Meas. Tech.ChEMBL_940885 (CHEMBL2330504)
EC50>34700±n/a nM
Citation Conda-Sheridan, MPark, EJBeck, DEReddy, PVNguyen, TXHu, BChen, LWhite, JJvan Breemen, RBPezzuto, JMCushman, M Design, synthesis, and biological evaluation of indenoisoquinoline rexinoids with chemopreventive potential. J Med Chem56:2581-605 (2013) 
 
Retinoic acid receptor RXR-alpha
Name:Retinoic acid receptor RXR-alpha
Type:PROTEIN
Mol. Mass.:50820.38
Organism:Homo sapiens (Human)
Description:ChEMBL_1456363
Residue:462
BDBM50396234
NameBDBM50396234
Synonyms:CHEMBL2172214 | US9402842, 57
TypeSmall organic molecule
Emp. Form.C21H19N3O3
Mol. Mass.361.3939
SMILESCC(=O)Nc1ccc2c3C(=O)c4ccccc4-c3n(CCCN)c(=O)c2c1