Reaction Details
TargetRetinoic acid receptor RXR-alpha
LigandBDBM50032671
Substrate/Competitorn/a
Meas. Tech.ChEMBL_940885 (CHEMBL2330504)
EC50 40±n/a nM
Citation Conda-Sheridan, MPark, EJBeck, DEReddy, PVNguyen, TXHu, BChen, LWhite, JJvan Breemen, RBPezzuto, JMCushman, M Design, synthesis, and biological evaluation of indenoisoquinoline rexinoids with chemopreventive potential. J Med Chem56:2581-605 (2013) 
 
Retinoic acid receptor RXR-alpha
Name:Retinoic acid receptor RXR-alpha
Type:PROTEIN
Mol. Mass.:50820.38
Organism:Homo sapiens (Human)
Description:ChEMBL_1456363
Residue:462
BDBM50032671
NameBDBM50032671
Synonyms:6-[1-(3,5,5,8,8-PENTAMETHYL-5,6,7,8-TETRAHYDRONAPHTHALEN-2-YL)CYCLOPROPYL]PYRIDINE-3-CARBOXYLIC ACID CHEMBL288436
TypeSmall organic molecule
Emp. Form.C24H29NO2
Mol. Mass.363.4926
SMILESCc1cc2c(cc1C1(CC1)c1ccc(cn1)C(O)=O)C(C)(C)CCC2(C)C