Reaction Details
TargetArginase-2, mitochondrial
LigandBDBM50427901
Substrate/Competitorn/a
Meas. Tech.ChEMBL_940978 (CHEMBL2330668)
IC50 1920±n/a nM
Citation Van Zandt, MCWhitehouse, DLGolebiowski, AJi, MKZhang, MBeckett, RPJagdmann, GERyder, TRSheeler, RAndreoli, MConway, BMahboubi, KD'Angelo, GMitschler, ACousido-Siah, ARuiz, FXHoward, EIPodjarny, ADSchroeter, H Discovery of (R)-2-amino-6-borono-2-(2-(piperidin-1-yl)ethyl)hexanoic acid and congeners as highly potent inhibitors of human arginases I and II for treatment of myocardial reperfusion injury. J Med Chem56:2568-80 (2013) 
 
Arginase-2, mitochondrial
Name:Arginase-2, mitochondrial
Type:PROTEIN
Mol. Mass.:38576.93
Organism:Homo sapiens (Human)
Description:ChEMBL_978892
Residue:354
BDBM50427901
NameBDBM50427901
Synonyms:CHEMBL2326088
TypeSmall organic molecule
Emp. Form.C6H14BNO4
Mol. Mass.174.991
SMILESN[C@H](CCCCB(O)O)C(O)=O