Reaction Details
TargetArginase-1
LigandBDBM50427910
Substrate/Competitorn/a
Meas. Tech.ChEMBL_940979 (CHEMBL2330669)
IC50 260±n/a nM
Citation Van Zandt, MCWhitehouse, DLGolebiowski, AJi, MKZhang, MBeckett, RPJagdmann, GERyder, TRSheeler, RAndreoli, MConway, BMahboubi, KD'Angelo, GMitschler, ACousido-Siah, ARuiz, FXHoward, EIPodjarny, ADSchroeter, H Discovery of (R)-2-amino-6-borono-2-(2-(piperidin-1-yl)ethyl)hexanoic acid and congeners as highly potent inhibitors of human arginases I and II for treatment of myocardial reperfusion injury. J Med Chem56:2568-80 (2013) 
 
Arginase-1
Name:Arginase-1
Type:PROTEIN
Mol. Mass.:34737.53
Organism:Homo sapiens (Human)
Description:ChEMBL_978893
Residue:322
BDBM50427910
NameBDBM50427910
Synonyms:CHEMBL2326096
TypeSmall organic molecule
Emp. Form.C13H27BN2O5
Mol. Mass.302.175
SMILESN[C@](CCCCB(O)O)(CCN1CC[C@@H](CO)C1)C(O)=O