Reaction Details
TargetSialidase-4
LigandBDBM50428075
Substrate/Competitorn/a
Meas. Tech.ChEMBL_941546 (CHEMBL2330586)
IC50 200000±n/a nM
Citation Zhang, YAlbohy, AZou, YSmutova, VPshezhetsky, AVCairo, CW Identification of selective inhibitors for human neuraminidase isoenzymes using C4,C7-modified 2-deoxy-2,3-didehydro-N-acetylneuraminic acid (DANA) analogues. J Med Chem56:2948-58 (2013) 
 
Sialidase-4
Name:Sialidase-4
Type:PROTEIN
Mol. Mass.:51579.82
Organism:Homo sapiens (Human)
Description:ChEMBL_960637
Residue:484
BDBM50428075
NameBDBM50428075
Synonyms:CHEMBL2323564
TypeSmall organic molecule
Emp. Form.C22H25N3O5
Mol. Mass.411.451
SMILESCC(=O)N[C@@H]1[C@@H](O)C=C(O[C@H]1CNNCc1ccc(cc1)-c1ccccc1)C(O)=O