Reaction Details
TargetSialidase-4
LigandBDBM50428078
Substrate/Competitorn/a
Meas. Tech.ChEMBL_941546 (CHEMBL2330586)
IC50>1000000±n/a nM
Citation Zhang, YAlbohy, AZou, YSmutova, VPshezhetsky, AVCairo, CW Identification of selective inhibitors for human neuraminidase isoenzymes using C4,C7-modified 2-deoxy-2,3-didehydro-N-acetylneuraminic acid (DANA) analogues. J Med Chem56:2948-58 (2013) 
 
Sialidase-4
Name:Sialidase-4
Type:PROTEIN
Mol. Mass.:51579.82
Organism:Homo sapiens (Human)
Description:ChEMBL_960637
Residue:484
BDBM50428078
NameBDBM50428078
Synonyms:CHEMBL2323561
TypeSmall organic molecule
Emp. Form.C15H19N3O4
Mol. Mass.305.3291
SMILESCC(=O)N[C@@H]1[C@@H](N)C=C(O[C@H]1CNc1ccccc1)C(O)=O