Reaction Details
TargetSialidase-3
LigandBDBM50428072
Substrate/Competitorn/a
Meas. Tech.ChEMBL_941547 (CHEMBL2330587)
IC50 50000±n/a nM
Citation Zhang, YAlbohy, AZou, YSmutova, VPshezhetsky, AVCairo, CW Identification of selective inhibitors for human neuraminidase isoenzymes using C4,C7-modified 2-deoxy-2,3-didehydro-N-acetylneuraminic acid (DANA) analogues. J Med Chem56:2948-58 (2013) 
 
Sialidase-3
Name:Sialidase-3
Type:PROTEIN
Mol. Mass.:48257.99
Organism:Homo sapiens (Human)
Description:ChEMBL_461856
Residue:428
BDBM50428072
NameBDBM50428072
Synonyms:CHEMBL2325810
TypeSmall organic molecule
Emp. Form.C21H21N5O4
Mol. Mass.407.4225
SMILESCC(=O)N[C@H]1[C@H](CNc2ccc(cc2)-c2ccccc2)OC(=C[C@@H]1N=[N+]=[N-])C(O)=O