Reaction Details
TargetSialidase-3
LigandBDBM50428074
Substrate/Competitorn/a
Meas. Tech.ChEMBL_941547 (CHEMBL2330587)
IC50 54000±n/a nM
Citation Zhang, YAlbohy, AZou, YSmutova, VPshezhetsky, AVCairo, CW Identification of selective inhibitors for human neuraminidase isoenzymes using C4,C7-modified 2-deoxy-2,3-didehydro-N-acetylneuraminic acid (DANA) analogues. J Med Chem56:2948-58 (2013) 
 
Sialidase-3
Name:Sialidase-3
Type:PROTEIN
Mol. Mass.:48257.99
Organism:Homo sapiens (Human)
Description:ChEMBL_461856
Residue:428
BDBM50428074
NameBDBM50428074
Synonyms:CHEMBL2325808
TypeSmall organic molecule
Emp. Form.C11H16N4O7
Mol. Mass.316.2673
SMILESCC(=O)N[C@@H]1[C@H](C=C(O[C@H]1[C@H](O)[C@H](O)CO)C(O)=O)N=[N+]=[N-]