Reaction Details
TargetNeuronal acetylcholine receptor subunit alpha-7
LigandBDBM50428082
Substrate/Competitorn/a
Meas. Tech.ChEMBL_941648 (CHEMBL2330766)
Ki 160000±n/a nM
Citation Liu, YRichardson, JTran, TAl-Muhtasib, NXie, TYenugonda, VMSexton, HGRezvani, AHLevin, EDSahibzada, NKellar, KJBrown, MLXiao, YPaige, M Chemistry and pharmacological studies of 3-alkoxy-2,5-disubstituted-pyridinyl compounds as novel selectivea4ß2 nicotinic acetylcholine receptor ligands that reduce alcohol intake in rats. J Med Chem56:3000-11 (2013) 
 
Neuronal acetylcholine receptor subunit alpha-7
Name:Neuronal acetylcholine receptor subunit alpha-7
Type:Enzyme
Mol. Mass.:56502.44
Organism:Rattus norvegicus (Rat)
Description:Q05941
Residue:502
BDBM50428082
NameBDBM50428082
Synonyms:CHEMBL2323565 | US9303017, (R)-15, YL-1-171
TypeSmall organic molecule
Emp. Form.C16H22N2O
Mol. Mass.258.3587
SMILESCCCCC#Cc1cnc(C)c(OC[C@H]2CCN2)c1