Reaction Details
TargetCannabinoid receptor 2
LigandBDBM50428091
Substrate/Competitorn/a
Meas. Tech.ChEMBL_943915 (CHEMBL2339882)
EC50 8730±n/a nM
Citation Rempel, VFuchs, AHinz, SKarcz, TLehr, MKoetter, UMüller, CE Magnolia Extract, Magnolol, and Metabolites: Activation of Cannabinoid CB2 Receptors and Blockade of the Related GPR55. ACS Med Chem Lett4:41-5 (2013) 
 
Cannabinoid receptor 2
Name:Cannabinoid receptor 2
Type:G Protein-Coupled Receptor (GPCR)
Mol. Mass.:39690.94
Organism:Homo sapiens (Human)
Description:P34972
Residue:360
BDBM50428091
NameBDBM50428091
Synonyms:CHEMBL179840
TypeSmall organic molecule
Emp. Form.C18H18O2
Mol. Mass.266.3343
SMILESC\C=C\c1ccc(O)c(c1)-c1cc(\C=C\C)ccc1O