Reaction Details
TargetCannabinoid receptor 2
LigandBDBM50428093
Substrate/Competitorn/a
Meas. Tech.ChEMBL_943917 (CHEMBL2339884)
Ki>10000±n/a nM
Citation Rempel, VFuchs, AHinz, SKarcz, TLehr, MKoetter, UMüller, CE Magnolia Extract, Magnolol, and Metabolites: Activation of Cannabinoid CB2 Receptors and Blockade of the Related GPR55. ACS Med Chem Lett4:41-5 (2013) 
 
Cannabinoid receptor 2
Name:Cannabinoid receptor 2
Type:G Protein-Coupled Receptor (GPCR)
Mol. Mass.:39690.94
Organism:Homo sapiens (Human)
Description:P34972
Residue:360
BDBM50428093
NameBDBM50428093
Synonyms:8,9-dihydroxydihydro-magnolol | CHEMBL2331642
TypeSmall organic molecule
Emp. Form.C18H20O4
Mol. Mass.300.349
SMILESOCC(O)Cc1ccc(O)c(c1)-c1cc(CC=C)ccc1O