Reaction Details
TargetCannabinoid receptor 1
LigandBDBM21278
Substrate/Competitorn/a
Meas. Tech.ChEMBL_943918 (CHEMBL2339885)
Ki 13±n/a nM
Citation Rempel, VFuchs, AHinz, SKarcz, TLehr, MKoetter, UMüller, CE Magnolia Extract, Magnolol, and Metabolites: Activation of Cannabinoid CB2 Receptors and Blockade of the Related GPR55. ACS Med Chem Lett4:41-5 (2013) 
 
Cannabinoid receptor 1
Name:Cannabinoid receptor 1
Type:G Protein-Coupled Receptor (GPCR)
Mol. Mass.:52868.96
Organism:Homo sapiens (Human)
Description:P21554
Residue:472
BDBM21278
NameBDBM21278
Synonyms:5-(4-chlorophenyl)-1-(2,4-dichlorophenyl)-4-methyl-N-(piperidin-1-yl)-1H-pyrazole-3-carboxamide CHEMBL111 RIMONABANT HYDROCHLORIDE SR 141716A SR141716A [3H]SR141716A
TypeSmall organic molecule
Emp. Form.C22H21Cl3N4O
Mol. Mass.463.787
SMILESCc1c(nn(c1-c1ccc(Cl)cc1)-c1ccc(Cl)cc1Cl)C(=O)NN1CCCCC1