Reaction Details
TargetCannabinoid receptor 1
LigandBDBM50428093
Substrate/Competitorn/a
Meas. Tech.ChEMBL_943918 (CHEMBL2339885)
Ki>10000±n/a nM
Citation Rempel, VFuchs, AHinz, SKarcz, TLehr, MKoetter, UMüller, CE Magnolia Extract, Magnolol, and Metabolites: Activation of Cannabinoid CB2 Receptors and Blockade of the Related GPR55. ACS Med Chem Lett4:41-5 (2013) 
 
Cannabinoid receptor 1
Name:Cannabinoid receptor 1
Type:G Protein-Coupled Receptor (GPCR)
Mol. Mass.:52868.96
Organism:Homo sapiens (Human)
Description:P21554
Residue:472
BDBM50428093
NameBDBM50428093
Synonyms:8,9-dihydroxydihydro-magnolol | CHEMBL2331642
TypeSmall organic molecule
Emp. Form.C18H20O4
Mol. Mass.300.349
SMILESOCC(O)Cc1ccc(O)c(c1)-c1cc(CC=C)ccc1O