Reaction Details
TargetCannabinoid receptor 2
LigandBDBM50295926
Substrate/Competitorn/a
Meas. Tech.ChEMBL_943917 (CHEMBL2339884)
Ki 44±n/a nM
Citation Rempel, VFuchs, AHinz, SKarcz, TLehr, MKoetter, UMüller, CE Magnolia Extract, Magnolol, and Metabolites: Activation of Cannabinoid CB2 Receptors and Blockade of the Related GPR55. ACS Med Chem Lett4:41-5 (2013) 
 
Cannabinoid receptor 2
Name:Cannabinoid receptor 2
Type:G Protein-Coupled Receptor (GPCR)
Mol. Mass.:39690.94
Organism:Homo sapiens (Human)
Description:P34972
Residue:360
BDBM50295926
NameBDBM50295926
Synonyms:4'-O-methylhonokiol, MH 5,3'-Diallyl-4'-methoxy-biphenyl-2-ol Magreth-14a | Methylhonokiol
TypeSmall organic molecule
Emp. Form.C19H20O2
Mol. Mass.280.3609
SMILESCOc1ccc(cc1CC=C)-c1cc(CC=C)ccc1O