Reaction Details
TargetSerine/threonine-protein kinase mTOR
LigandBDBM50428109
Substrate/Competitorn/a
Meas. Tech.ChEMBL_944958 (CHEMBL2343997)
Ki 0.243000±n/a nM
Citation Cheng, HLi, CBailey, SBaxi, SMGoulet, LGuo, LHoffman, JJiang, YJohnson, TOJohnson, TWKnighton, DRLi, JLiu, KKLiu, ZMarx, MAWalls, MWells, PAYin, MJZhu, JZientek, M Discovery of the Highly Potent PI3K/mTOR Dual Inhibitor PF-04979064 through Structure-Based Drug Design. ACS Med Chem Lett4:91-7 (2013) 
 
Serine/threonine-protein kinase mTOR
Name:Serine/threonine-protein kinase mTOR
Type:Rapamycin target protein
Mol. Mass.:288917.12
Organism:Homo sapiens (Human)
Description:P42345
Residue:2549
BDBM50428109
NameBDBM50428109
Synonyms:CHEMBL2331668 | US8791131, 259
TypeSmall organic molecule
Emp. Form.C23H22N8O2
Mol. Mass.442.4732
SMILESCC(=O)N1CCC(CC1)n1c2c(cnc3ccc(nc23)-c2cnc3[nH]ncc3c2)n(C)c1=O