Reaction Details
TargetSerine/threonine-protein kinase mTOR
LigandBDBM50428118
Substrate/Competitorn/a
Meas. Tech.ChEMBL_944958 (CHEMBL2343997)
Ki 2.0±n/a nM
Citation Cheng, HLi, CBailey, SBaxi, SMGoulet, LGuo, LHoffman, JJiang, YJohnson, TOJohnson, TWKnighton, DRLi, JLiu, KKLiu, ZMarx, MAWalls, MWells, PAYin, MJZhu, JZientek, M Discovery of the Highly Potent PI3K/mTOR Dual Inhibitor PF-04979064 through Structure-Based Drug Design. ACS Med Chem Lett4:91-7 (2013) 
 
Serine/threonine-protein kinase mTOR
Name:Serine/threonine-protein kinase mTOR
Type:Rapamycin target protein
Mol. Mass.:288917.12
Organism:Homo sapiens (Human)
Description:P42345
Residue:2549
BDBM50428118
NameBDBM50428118
Synonyms:CHEMBL2331659 | US8791131, 134
TypeSmall organic molecule
Emp. Form.C22H23N5O3
Mol. Mass.405.4497
SMILESCOc1ccc(cn1)-c1ccc2ncc3n(C)c(=O)n([C@H]4CC[C@H](O)CC4)c3c2n1