Reaction Details
TargetSerine/threonine-protein kinase mTOR
LigandBDBM50428131
Substrate/Competitorn/a
Meas. Tech.ChEMBL_944986 (CHEMBL2344477)
Ki 0.40±n/a nM
Citation Pei, ZBlackwood, ELiu, LMalek, SBelvin, MKoehler, MFOrtwine, DFChen, HCohen, FKenny, JRBergeron, PLau, KLy, CZhao, XEstrada, AATruong, TEpler, JANonomiya, JTrinh, LSideris, SLesnick, JBao, LVijapurkar, UMukadam, STay, SDeshmukh, GChen, YHDing, XFriedman, LSLyssikatos, JP Discovery and Biological Profiling of Potent and Selective mTOR Inhibitor GDC-0349. ACS Med Chem Lett4:103-7 (2013) 
 
Serine/threonine-protein kinase mTOR
Name:Serine/threonine-protein kinase mTOR
Type:Rapamycin target protein
Mol. Mass.:288917.12
Organism:Homo sapiens (Human)
Description:P42345
Residue:2549
BDBM50428131
NameBDBM50428131
Synonyms:CHEMBL2331687
TypeSmall organic molecule
Emp. Form.C26H27N9O2
Mol. Mass.497.5517
SMILESC[C@H]1COCCN1c1nc(nc2CN(CCc12)c1ncccn1)-c1ccc(Nc2nccc(=O)[nH]2)cc1