Reaction Details
TargetMuscarinic acetylcholine receptor M4
LigandBDBM50061705
Substrate/Competitorn/a
Meas. Tech.ChEMBL_945483 (CHEMBL2343487)
EC50 5.7±n/a nM
Citation Sumiyoshi, TEnomoto, TTakai, KTakahashi, YKonishi, YUruno, YTojo, KSuwa, AMatsuda, HNakako, TSakai, MKitamura, AUematsu, YKiyoshi, A Discovery of novel N-substituted oxindoles as selective m1 and m4 muscarinic acetylcholine receptors partial agonists. ACS Med Chem Lett4:244-8 (2013) 
 
Muscarinic acetylcholine receptor M4
Name:Muscarinic acetylcholine receptor M4
Type:Enzyme Catalytic Domain
Mol. Mass.:53079.31
Organism:Homo sapiens (Human)
Description:Cholinergic, muscarinic M4 CHRM4 HUMAN M3::P08173
Residue:479
BDBM50061705
NameBDBM50061705
Synonyms:(R)-1-Aza-bicyclo[2.2.2]oct-3-yl-[(Z)-methoxyimino]-acetonitrile SB-202026
TypeSmall organic molecule
Emp. Form.C10H15N3O
Mol. Mass.193.2456
SMILESCO\N=C(/C#N)[C@H]1CN2CCC1CC2