Reaction Details
TargetSphingosine 1-phosphate receptor 3
LigandBDBM50428151
Substrate/Competitorn/a
Meas. Tech.ChEMBL_945996 (CHEMBL2341527)
EC50 4000±n/a nM
Citation Pan, SGray, NSGao, WMi, YFan, YWang, XTuntland, TChe, JLefebvre, SChen, YChu, AHinterding, KGardin, AEnd, PHeining, PBruns, CCooke, NGNuesslein-Hildesheim, B Discovery of BAF312 (Siponimod), a Potent and Selective S1P Receptor Modulator. ACS Med Chem Lett4:333-7 (2013) 
 
Sphingosine 1-phosphate receptor 3
Name:Sphingosine 1-phosphate receptor 3
Type:G Protein-Coupled Receptor (GPCR)
Mol. Mass.:42278.13
Organism:Homo sapiens (Human)
Description:Q99500
Residue:378
BDBM50428151
NameBDBM50428151
Synonyms:CHEMBL2336062
TypeSmall organic molecule
Emp. Form.C24H29F3N2O3S
Mol. Mass.482.559
SMILESC\C(=N/OCc1ccc(C2CCCCC2)c(c1)C(F)(F)F)c1ccc(CNCCC(O)=O)s1