Reaction Details
TargetSphingosine 1-phosphate receptor 1
LigandBDBM50428149
Substrate/Competitorn/a
Meas. Tech.ChEMBL_945997 (CHEMBL2341528)
EC50 0.300000±n/a nM
Citation Pan, SGray, NSGao, WMi, YFan, YWang, XTuntland, TChe, JLefebvre, SChen, YChu, AHinterding, KGardin, AEnd, PHeining, PBruns, CCooke, NGNuesslein-Hildesheim, B Discovery of BAF312 (Siponimod), a Potent and Selective S1P Receptor Modulator. ACS Med Chem Lett4:333-7 (2013) 
 
Sphingosine 1-phosphate receptor 1
Name:Sphingosine 1-phosphate receptor 1
Type:Enzyme
Mol. Mass.:42836.02
Organism:Homo sapiens (Human)
Description:P21453
Residue:382
BDBM50428149
NameBDBM50428149
Synonyms:CHEMBL2336064
TypeSmall organic molecule
Emp. Form.C26H30F4N2O3
Mol. Mass.494.5216
SMILESC\C(=N/OCc1ccc(C2CCCCC2)c(c1)C(F)(F)F)c1ccc(CNCCC(O)=O)c(F)c1