Reaction Details
TargetCannabinoid receptor 2
LigandBDBM50428174
Substrate/Competitorn/a
Meas. Tech.ChEMBL_946420 (CHEMBL2339600)
Ki 4.0±n/a nM
Citation Ouyang, QTong, QFeng, RMyint, KZYang, PXie, XQ Trisubstituted Sulfonamides: a New Chemotype for Development of Potent and Selective CB ACS Med Chem Lett4:387-392 (2013) 
 
Cannabinoid receptor 2
Name:Cannabinoid receptor 2
Type:G Protein-Coupled Receptor (GPCR)
Mol. Mass.:39690.94
Organism:Homo sapiens (Human)
Description:P34972
Residue:360
BDBM50428174
NameBDBM50428174
Synonyms:CHEMBL2336549
TypeSmall organic molecule
Emp. Form.C22H27N3O3S2
Mol. Mass.445.598
SMILESCCN(CC)c1ccc(CN(c2ncc(C)s2)S(=O)(=O)c2ccc(OC)cc2)cc1