Reaction Details
TargetCannabinoid receptor 2
LigandBDBM50428181
Substrate/Competitorn/a
Meas. Tech.ChEMBL_946420 (CHEMBL2339600)
Ki 66±n/a nM
Citation Ouyang, QTong, QFeng, RMyint, KZYang, PXie, XQ Trisubstituted Sulfonamides: a New Chemotype for Development of Potent and Selective CB ACS Med Chem Lett4:387-392 (2013) 
 
Cannabinoid receptor 2
Name:Cannabinoid receptor 2
Type:G Protein-Coupled Receptor (GPCR)
Mol. Mass.:39690.94
Organism:Homo sapiens (Human)
Description:P34972
Residue:360
BDBM50428181
NameBDBM50428181
Synonyms:CHEMBL2336542
TypeSmall organic molecule
Emp. Form.C21H28N2O2S
Mol. Mass.372.524
SMILESCCN(CC)c1ccc(CN(CC=C)S(=O)(=O)c2ccc(C)cc2)cc1