Reaction Details
TargetCannabinoid receptor 2
LigandBDBM50428194
Substrate/Competitorn/a
Meas. Tech.ChEMBL_946420 (CHEMBL2339600)
Ki 44±n/a nM
Citation Ouyang, QTong, QFeng, RMyint, KZYang, PXie, XQ Trisubstituted Sulfonamides: a New Chemotype for Development of Potent and Selective CB ACS Med Chem Lett4:387-392 (2013) 
 
Cannabinoid receptor 2
Name:Cannabinoid receptor 2
Type:G Protein-Coupled Receptor (GPCR)
Mol. Mass.:39690.94
Organism:Homo sapiens (Human)
Description:P34972
Residue:360
BDBM50428194
NameBDBM50428194
Synonyms:CHEMBL2336552
TypeSmall organic molecule
Emp. Form.C26H30N2O2S
Mol. Mass.434.594
SMILESCc1ccc(cc1)S(=O)(=O)N(Cc1ccccc1)Cc1ccc(cc1)N1CCCCC1