Reaction Details
TargetCannabinoid receptor 2
LigandBDBM50399157
Substrate/Competitorn/a
Meas. Tech.ChEMBL_946010 (CHEMBL2341541)
EC50 85±n/a nM
Citation Ouyang, QTong, QFeng, RMyint, KZYang, PXie, XQ Trisubstituted Sulfonamides: a New Chemotype for Development of Potent and Selective CB ACS Med Chem Lett4:387-392 (2013) 
 
Cannabinoid receptor 2
Name:Cannabinoid receptor 2
Type:G Protein-Coupled Receptor (GPCR)
Mol. Mass.:39690.94
Organism:Homo sapiens (Human)
Description:P34972
Residue:360
BDBM50399157
NameBDBM50399157
Synonyms:CHEMBL2179724
TypeSmall organic molecule
Emp. Form.C27H42O3
Mol. Mass.414.6206
SMILESCCCCCCC(C)(C)c1cc(OC)c([C@H]2C=C(CO)[C@H]3C[C@@H]2C3(C)C)c(OC)c1