Reaction Details
TargetWD repeat-containing protein 5
LigandBDBM50428242
Substrate/Competitorn/a
Meas. Tech.ChEMBL_946433 (CHEMBL2339613)
Kd>20000±n/a nM
Citation Bolshan, YGetlik, MKuznetsova, EWasney, GAHajian, TPoda, GNguyen, KTWu, HDombrovski, LDong, ASenisterra, GSchapira, MArrowsmith, CHBrown, PJAl-Awar, RVedadi, MSmil, D Synthesis, Optimization, and Evaluation of Novel Small Molecules as Antagonists of WDR5-MLL Interaction. ACS Med Chem Lett4:353-7 (2013) 
 
WD repeat-containing protein 5
Name:WD repeat-containing protein 5
Type:Protein
Mol. Mass.:36597.13
Organism:Homo sapiens (Human)
Description:P61964
Residue:334
BDBM50428242
NameBDBM50428242
Synonyms:CHEMBL2337445
TypeSmall organic molecule
Emp. Form.C18H21ClN4O3
Mol. Mass.376.837
SMILESCN(C)CCN(C)c1ccc(cc1NC(=O)c1ccccc1Cl)[N+]([O-])=O