Reaction Details
TargetWD repeat-containing protein 5
LigandBDBM50428249
Substrate/Competitorn/a
Meas. Tech.ChEMBL_946433 (CHEMBL2339613)
Kd>20000±n/a nM
Citation Bolshan, YGetlik, MKuznetsova, EWasney, GAHajian, TPoda, GNguyen, KTWu, HDombrovski, LDong, ASenisterra, GSchapira, MArrowsmith, CHBrown, PJAl-Awar, RVedadi, MSmil, D Synthesis, Optimization, and Evaluation of Novel Small Molecules as Antagonists of WDR5-MLL Interaction. ACS Med Chem Lett4:353-7 (2013) 
 
WD repeat-containing protein 5
Name:WD repeat-containing protein 5
Type:Protein
Mol. Mass.:36597.13
Organism:Homo sapiens (Human)
Description:P61964
Residue:334
BDBM50428249
NameBDBM50428249
Synonyms:CHEMBL2337037
TypeSmall organic molecule
Emp. Form.C18H18ClN3O3
Mol. Mass.359.807
SMILES[O-][N+](=O)c1ccc(N2CCCCC2)c(NC(=O)c2ccccc2Cl)c1