Reaction Details
TargetFarnesyl pyrophosphate synthase
LigandBDBM50428295
Substrate/Competitorn/a
Meas. Tech.ChEMBL_947371 (CHEMBL2344604)
IC50 40±n/a nM
Citation Zhang, YZhu, WLiu, YLWang, HWang, KLi, KNo, JHAyong, LGulati, APang, RFreitas-Junior, LMorita, CTOld-Field, E Chemo-Immunotherapeutic Anti-Malarials Targeting Isoprenoid Biosynthesis. ACS Med Chem Lett4:423-427 (2013) 
 
Farnesyl pyrophosphate synthase
Name:Farnesyl pyrophosphate synthase
Type:Enzyme
Mol. Mass.:48272.89
Organism:Homo sapiens (Human)
Description:P14324
Residue:419
BDBM50428295
NameBDBM50428295
Synonyms:CHEMBL2338359
TypeSmall organic molecule
Emp. Form.C12H24N2O7P2
Mol. Mass.370.2757
SMILESCCCCCCCn1cc[n+](CC(O)(P(O)(O)=O)P(O)([O-])=O)c1