Reaction Details
TargetBroad substrate specificity ATP-binding cassette transporter ABCG2
LigandBDBM50428353
Substrate/Competitorn/a
Meas. Tech.ChEMBL_947405 (CHEMBL2345054)
IC50 1100±n/a nM
Citation Ochoa-Puentes, CBauer, SKühnle, MBernhardt, GBuschauer, AKönig, B Benzanilide-Biphenyl Replacement: A Bioisosteric Approach to Quinoline Carboxamide-Type ABCG2 Modulators. ACS Med Chem Lett4:393-6 (2013) 
 
Broad substrate specificity ATP-binding cassette transporter ABCG2
Name:Broad substrate specificity ATP-binding cassette transporter ABCG2
Type:Multi-pass membrane protein; monomer or homodimer; disulfide-linked
Mol. Mass.:72329.48
Organism:Homo sapiens (Human)
Description:Q9UNQ0
Residue:655
BDBM50428353
NameBDBM50428353
Synonyms:CHEMBL2331723
TypeSmall organic molecule
Emp. Form.C35H31N3O3
Mol. Mass.541.6389
SMILESCOC(=O)c1ccc(cc1NC(=O)c1ccc2ccccc2n1)-c1ccc(CCN2CCc3ccccc3C2)cc1