Reaction Details
TargetBroad substrate specificity ATP-binding cassette transporter ABCG2
LigandBDBM50428355
Substrate/Competitorn/a
Meas. Tech.ChEMBL_947405 (CHEMBL2345054)
IC50 943±n/a nM
Citation Ochoa-Puentes, CBauer, SKühnle, MBernhardt, GBuschauer, AKönig, B Benzanilide-Biphenyl Replacement: A Bioisosteric Approach to Quinoline Carboxamide-Type ABCG2 Modulators. ACS Med Chem Lett4:393-6 (2013) 
 
Broad substrate specificity ATP-binding cassette transporter ABCG2
Name:Broad substrate specificity ATP-binding cassette transporter ABCG2
Type:Multi-pass membrane protein; monomer or homodimer; disulfide-linked
Mol. Mass.:72329.48
Organism:Homo sapiens (Human)
Description:Q9UNQ0
Residue:655
BDBM50428355
NameBDBM50428355
Synonyms:CHEMBL2331717
TypeSmall organic molecule
Emp. Form.C36H33N3O5
Mol. Mass.587.6643
SMILESCOC(=O)c1ccc(cc1NC(=O)c1ccc2ccccc2n1)-c1ccc(CN2CCc3cc(OC)c(OC)cc3C2)cc1