Reaction Details
TargetBroad substrate specificity ATP-binding cassette transporter ABCG2
LigandBDBM50428347
Substrate/Competitorn/a
Meas. Tech.ChEMBL_947405 (CHEMBL2345054)
IC50 544±n/a nM
Citation Ochoa-Puentes, CBauer, SKühnle, MBernhardt, GBuschauer, AKönig, B Benzanilide-Biphenyl Replacement: A Bioisosteric Approach to Quinoline Carboxamide-Type ABCG2 Modulators. ACS Med Chem Lett4:393-6 (2013) 
 
Broad substrate specificity ATP-binding cassette transporter ABCG2
Name:Broad substrate specificity ATP-binding cassette transporter ABCG2
Type:Multi-pass membrane protein; monomer or homodimer; disulfide-linked
Mol. Mass.:72329.48
Organism:Homo sapiens (Human)
Description:Q9UNQ0
Residue:655
BDBM50428347
NameBDBM50428347
Synonyms:CHEMBL2331716
TypeSmall organic molecule
Emp. Form.C49H59N3O11
Mol. Mass.866.0063
SMILESCOCCOCCOCCOc1cc2CCN(CCc3ccc(cc3)-c3ccc(C(=O)OC)c(NC(=O)c4ccc5ccccc5n4)c3)Cc2cc1OCCOCCOCCOC