Reaction Details
TargetVascular endothelial growth factor receptor 3
LigandBDBM50428367
Substrate/Competitorn/a
Meas. Tech.ChEMBL_947886 (CHEMBL2343629)
IC50 1.8±n/a nM
Citation Nosaka, CAdachi, HSawa, RNakae, KAtsumi, SKinoshita, NKubota, YIgarashi, MSei, YYamaguchi, KShibuya, MNishimura, YAkamatsu, Y Vegfrecine, an inhibitor of VEGF receptor tyrosine kinases isolated from the culture broth of Streptomyces sp. J Nat Prod76:715-9 (2013) 
 
Vascular endothelial growth factor receptor 3
Name:Vascular endothelial growth factor receptor 3
Type:Protein
Mol. Mass.:152749.58
Organism:Homo sapiens (Human)
Description:P35916-2
Residue:1363
BDBM50428367
NameBDBM50428367
Synonyms:CHEMBL2332119 | Vegfrecine
TypeSmall organic molecule
Emp. Form.C13H11N3O4
Mol. Mass.273.2441
SMILESNC(=O)C1=C(N)C(=O)C=C(Nc2ccccc2O)C1=O