Reaction Details
TargetNeuronal acetylcholine receptor subunit alpha-7
LigandBDBM50428371
Substrate/Competitorn/a
Meas. Tech.ChEMBL_947924 (CHEMBL2343667)
Ki 29000±n/a nM
Citation Tasso, BNovelli, FSparatore, FFasoli, FGotti, C (+)-Laburnamine, a natural selective ligand and partial agonist for the?4?2 nicotinic receptor subtype. J Nat Prod76:727-31 (2013) 
 
Neuronal acetylcholine receptor subunit alpha-7
Name:Neuronal acetylcholine receptor subunit alpha-7
Type:Enzyme
Mol. Mass.:56502.44
Organism:Rattus norvegicus (Rat)
Description:Q05941
Residue:502
BDBM50428371
NameBDBM50428371
Synonyms:CHEMBL2332153
TypeSmall organic molecule
Emp. Form.C12H22N2O
Mol. Mass.210.3159
SMILESCC(C)C(=O)N[C@@H]1CCN2CCCC[C@@H]12