Reaction Details
TargetCarbonic anhydrase 9
LigandBDBM50428376
Substrate/Competitorn/a
Meas. Tech.ChEMBL_942103 (CHEMBL2340801)
Ki 310±n/a nM
Citation Carta, FVullo, DMaresca, AScozzafava, ASupuran, CT Mono-/dihydroxybenzoic acid esters and phenol pyridinium derivatives as inhibitors of the mammalian carbonic anhydrase isoforms I, II, VII, IX, XII and XIV. Bioorg Med Chem21:1564-9 (2013) 
 
Carbonic anhydrase 9
Name:Carbonic anhydrase 9
Type:Enzyme
Mol. Mass.:49669.03
Organism:Homo sapiens (Human)
Description:Catalytic domain of human cloned isozyme was used in the assay
Residue:459
BDBM50428376
NameBDBM50428376
Synonyms:CHEMBL2333963 | Isopropyl 2,4-Dihydroxybenzoate
TypeSmall organic molecule
Emp. Form.C10H12O4
Mol. Mass.196.1999
SMILESCC(C)OC(=O)c1ccc(O)cc1O