Reaction Details
TargetCarbonic anhydrase 2
LigandBDBM50428382
Substrate/Competitorn/a
Meas. Tech.ChEMBL_942105 (CHEMBL2340803)
Ki 320±n/a nM
Citation Carta, FVullo, DMaresca, AScozzafava, ASupuran, CT Mono-/dihydroxybenzoic acid esters and phenol pyridinium derivatives as inhibitors of the mammalian carbonic anhydrase isoforms I, II, VII, IX, XII and XIV. Bioorg Med Chem21:1564-9 (2013) 
 
Carbonic anhydrase 2
Name:Carbonic anhydrase 2
Type:Enzyme
Mol. Mass.:29250.71
Organism:Homo sapiens (Human)
Description:P00918
Residue:260
BDBM50428382
NameBDBM50428382
Synonyms:CHEMBL2333960
TypeSmall organic molecule
Emp. Form.C14H16NO
Mol. Mass.214.2824
SMILESCc1cc(C)[n+](c(C)c1)-c1cccc(O)c1