Reaction Details
TargetCarbonic anhydrase 2
LigandBDBM50428392
Substrate/Competitorn/a
Meas. Tech.ChEMBL_942105 (CHEMBL2340803)
Ki 690±n/a nM
Citation Carta, FVullo, DMaresca, AScozzafava, ASupuran, CT Mono-/dihydroxybenzoic acid esters and phenol pyridinium derivatives as inhibitors of the mammalian carbonic anhydrase isoforms I, II, VII, IX, XII and XIV. Bioorg Med Chem21:1564-9 (2013) 
 
Carbonic anhydrase 2
Name:Carbonic anhydrase 2
Type:Enzyme
Mol. Mass.:29250.71
Organism:Homo sapiens (Human)
Description:P00918
Residue:260
BDBM50428392
NameBDBM50428392
Synonyms:CHEMBL486218 | Methyl 3,5-Dihydroxybenzoate
TypeSmall organic molecule
Emp. Form.C8H8O4
Mol. Mass.168.1467
SMILESCOC(=O)c1cc(O)cc(O)c1