Reaction Details
TargetCarbonic anhydrase 14
LigandBDBM50336490
Substrate/Competitorn/a
Meas. Tech.ChEMBL_942101 (CHEMBL2340799)
Ki 650±n/a nM
Citation Carta, FVullo, DMaresca, AScozzafava, ASupuran, CT Mono-/dihydroxybenzoic acid esters and phenol pyridinium derivatives as inhibitors of the mammalian carbonic anhydrase isoforms I, II, VII, IX, XII and XIV. Bioorg Med Chem21:1564-9 (2013) 
 
Carbonic anhydrase 14
Name:Carbonic anhydrase 14
Type:Enzyme
Mol. Mass.:37665.67
Organism:Homo sapiens (Human)
Description:Human (cloned) isozyme.
Residue:337
BDBM50336490
NameBDBM50336490
Synonyms:3,5-DIHYDROXYBENZOATE 3,5-Dihydroxybenzoate, IX 3,5-dihydroxybenzoicacid | CHEMBL95308
TypeSmall organic molecule
Emp. Form.C7H6O4
Mol. Mass.154.1201
SMILESOC(=O)c1cc(O)cc(O)c1