Reaction Details
TargetCarbonic anhydrase 14
LigandBDBM50100861
Substrate/Competitorn/a
Meas. Tech.ChEMBL_942101 (CHEMBL2340799)
Ki 690±n/a nM
Citation Carta, FVullo, DMaresca, AScozzafava, ASupuran, CT Mono-/dihydroxybenzoic acid esters and phenol pyridinium derivatives as inhibitors of the mammalian carbonic anhydrase isoforms I, II, VII, IX, XII and XIV. Bioorg Med Chem21:1564-9 (2013) 
 
Carbonic anhydrase 14
Name:Carbonic anhydrase 14
Type:Enzyme
Mol. Mass.:37665.67
Organism:Homo sapiens (Human)
Description:Human (cloned) isozyme.
Residue:337
BDBM50100861
NameBDBM50100861
Synonyms:3,4-Dihydroxybenzoate, VIII 4,5-Dihydroxybenzoic acid CHEMBL37537 Protocatechuic acid (M1) cid_72
TypeSmall organic molecule
Emp. Form.C7H6O4
Mol. Mass.154.1201
SMILESOC(=O)c1ccc(O)c(O)c1