Reaction Details
TargetCarbonic anhydrase 9
LigandBDBM50428381
Substrate/Competitorn/a
Meas. Tech.ChEMBL_942103 (CHEMBL2340801)
Ki 700±n/a nM
Citation Carta, FVullo, DMaresca, AScozzafava, ASupuran, CT Mono-/dihydroxybenzoic acid esters and phenol pyridinium derivatives as inhibitors of the mammalian carbonic anhydrase isoforms I, II, VII, IX, XII and XIV. Bioorg Med Chem21:1564-9 (2013) 
 
Carbonic anhydrase 9
Name:Carbonic anhydrase 9
Type:Enzyme
Mol. Mass.:49669.03
Organism:Homo sapiens (Human)
Description:Catalytic domain of human cloned isozyme was used in the assay
Residue:459
BDBM50428381
NameBDBM50428381
Synonyms:CHEMBL2333961
TypeSmall organic molecule
Emp. Form.C14H15ClNO
Mol. Mass.248.727
SMILESCc1cc(C)[n+](c(C)c1)-c1cc(O)ccc1Cl