Reaction Details
TargetCarbonic anhydrase 1
LigandBDBM50428404
Substrate/Competitorn/a
Meas. Tech.ChEMBL_942114 (CHEMBL2341270)
Ki 6764±n/a nM
Citation Compain, GMartin-Mingot, AMaresca, AThibaudeau, SSupuran, CT Superacid synthesis of halogen containing N-substituted-4-aminobenzene sulfonamides: new selective tumor-associated carbonic anhydrase inhibitors. Bioorg Med Chem21:1555-63 (2013) 
 
Carbonic anhydrase 1
Name:Carbonic anhydrase 1
Type:Enzyme
Mol. Mass.:28873.37
Organism:Homo sapiens (Human)
Description:P00915
Residue:261
BDBM50428404
NameBDBM50428404
Synonyms:CHEMBL2333974
TypeSmall organic molecule
Emp. Form.C9H12ClFN2O2S
Mol. Mass.266.72
SMILESNc1ccc(cc1)S(=O)(=O)NCCC(F)Cl