Reaction Details
TargetCarbonic anhydrase 1
LigandBDBM50428406
Substrate/Competitorn/a
Meas. Tech.ChEMBL_942114 (CHEMBL2341270)
Ki 5179±n/a nM
Citation Compain, GMartin-Mingot, AMaresca, AThibaudeau, SSupuran, CT Superacid synthesis of halogen containing N-substituted-4-aminobenzene sulfonamides: new selective tumor-associated carbonic anhydrase inhibitors. Bioorg Med Chem21:1555-63 (2013) 
 
Carbonic anhydrase 1
Name:Carbonic anhydrase 1
Type:Enzyme
Mol. Mass.:28873.37
Organism:Homo sapiens (Human)
Description:P00915
Residue:261
BDBM50428406
NameBDBM50428406
Synonyms:CHEMBL2333972
TypeSmall organic molecule
Emp. Form.C9H12ClFN2O2S
Mol. Mass.266.72
SMILESCC(F)(Cl)CNS(=O)(=O)c1ccc(N)cc1