Reaction Details
TargetCarbonic anhydrase 1
LigandBDBM50428407
Substrate/Competitorn/a
Meas. Tech.ChEMBL_942114 (CHEMBL2341270)
Ki 4800±n/a nM
Citation Compain, GMartin-Mingot, AMaresca, AThibaudeau, SSupuran, CT Superacid synthesis of halogen containing N-substituted-4-aminobenzene sulfonamides: new selective tumor-associated carbonic anhydrase inhibitors. Bioorg Med Chem21:1555-63 (2013) 
 
Carbonic anhydrase 1
Name:Carbonic anhydrase 1
Type:Enzyme
Mol. Mass.:28873.37
Organism:Homo sapiens (Human)
Description:P00915
Residue:261
BDBM50428407
NameBDBM50428407
Synonyms:CHEMBL2333971
TypeSmall organic molecule
Emp. Form.C11H15FN2O3S
Mol. Mass.274.312
SMILESCC(F)CNS(=O)(=O)c1ccc(NC(C)=O)cc1