Reaction Details
TargetCarbonic anhydrase 1
LigandBDBM50080733
Substrate/Competitorn/a
Meas. Tech.ChEMBL_942114 (CHEMBL2341270)
Ki 164±n/a nM
Citation Compain, GMartin-Mingot, AMaresca, AThibaudeau, SSupuran, CT Superacid synthesis of halogen containing N-substituted-4-aminobenzene sulfonamides: new selective tumor-associated carbonic anhydrase inhibitors. Bioorg Med Chem21:1555-63 (2013) 
 
Carbonic anhydrase 1
Name:Carbonic anhydrase 1
Type:Enzyme
Mol. Mass.:28873.37
Organism:Homo sapiens (Human)
Description:P00915
Residue:261
BDBM50080733
NameBDBM50080733
Synonyms:4-(4-aminophenylsulfonamido)-1-benzenesulfonamide 4-amino-N-[4-(aminosulfonyl)phenyl]benzenesulfonamide CHEMBL269122 | cid_68351
TypeSmall organic molecule
Emp. Form.C12H13N3O4S2
Mol. Mass.327.379
SMILESNc1ccc(cc1)S(=O)(=O)Nc1ccc(cc1)S(N)(=O)=O