Reaction Details
TargetCarbonic anhydrase 1
LigandBDBM10857
Substrate/Competitorn/a
Meas. Tech.ChEMBL_942114 (CHEMBL2341270)
Ki 25000±n/a nM
Citation Compain, GMartin-Mingot, AMaresca, AThibaudeau, SSupuran, CT Superacid synthesis of halogen containing N-substituted-4-aminobenzene sulfonamides: new selective tumor-associated carbonic anhydrase inhibitors. Bioorg Med Chem21:1555-63 (2013) 
 
Carbonic anhydrase 1
Name:Carbonic anhydrase 1
Type:Enzyme
Mol. Mass.:28873.37
Organism:Homo sapiens (Human)
Description:P00915
Residue:261
BDBM10857
NameBDBM10857
Synonyms:4-aminobenzene-1-sulfonamide Sulfanilamide aromatic/heteroaromatic sulfonamide 2 | halogenosulfanilamide deriv. 5a
TypeSmall organic molecule
Emp. Form.C6H8N2O2S
Mol. Mass.172.205
SMILESNc1ccc(cc1)S(N)(=O)=O