Reaction Details
TargetCarbonic anhydrase 2
LigandBDBM50428409
Substrate/Competitorn/a
Meas. Tech.ChEMBL_942113 (CHEMBL2341269)
Ki 4708±n/a nM
Citation Compain, GMartin-Mingot, AMaresca, AThibaudeau, SSupuran, CT Superacid synthesis of halogen containing N-substituted-4-aminobenzene sulfonamides: new selective tumor-associated carbonic anhydrase inhibitors. Bioorg Med Chem21:1555-63 (2013) 
 
Carbonic anhydrase 2
Name:Carbonic anhydrase 2
Type:Enzyme
Mol. Mass.:29250.71
Organism:Homo sapiens (Human)
Description:P00918
Residue:260
BDBM50428409
NameBDBM50428409
Synonyms:CHEMBL2333969
TypeSmall organic molecule
Emp. Form.C10H14N2O2S
Mol. Mass.226.295
SMILESCC(=C)CNS(=O)(=O)c1ccc(N)cc1