Reaction Details
TargetCarbonic anhydrase 12
LigandBDBM12342
Substrate/Competitorn/a
Meas. Tech.ChEMBL_942127 (CHEMBL2341283)
Ki>1000000±n/a nM
Citation Davis, RAVullo, DMaresca, ASupuran, CTPoulsen, SA Natural product coumarins that inhibit human carbonic anhydrases. Bioorg Med Chem21:1539-43 (2013) 
 
Carbonic anhydrase 12
Name:Carbonic anhydrase 12
Type:Enzyme
Mol. Mass.:39456.00
Organism:Homo sapiens (Human)
Description:Catalytic domain of human cloned isozyme was used in the assay
Residue:354
BDBM12342
NameBDBM12342
Synonyms:2H-chromen-2-one Coumarin
TypeNatural product
Emp. Form.C9H6O2
Mol. Mass.146.1427
SMILESO=c1ccc2ccccc2o1