Reaction Details
TargetCarbonic anhydrase 7
LigandBDBM50428422
Substrate/Competitorn/a
Meas. Tech.ChEMBL_942129 (CHEMBL2341285)
Ki>100000±n/a nM
Citation Davis, RAVullo, DMaresca, ASupuran, CTPoulsen, SA Natural product coumarins that inhibit human carbonic anhydrases. Bioorg Med Chem21:1539-43 (2013) 
 
Carbonic anhydrase 7
Name:Carbonic anhydrase 7
Type:Enzyme
Mol. Mass.:29664.11
Organism:Homo sapiens (Human)
Description:Human cloned isozyme.
Residue:264
BDBM50428422
NameBDBM50428422
Synonyms:CHEMBL2334352
TypeSmall organic molecule
Emp. Form.C21H19NO5
Mol. Mass.365.3793
SMILESCOc1ccc2ccc(=O)oc2c1C(COC(=O)c1cccnc1)C(C)=C