Reaction Details
TargetCarbonic anhydrase 2
LigandBDBM50428427
Substrate/Competitorn/a
Meas. Tech.ChEMBL_942130 (CHEMBL2341286)
Ki>100000±n/a nM
Citation Davis, RAVullo, DMaresca, ASupuran, CTPoulsen, SA Natural product coumarins that inhibit human carbonic anhydrases. Bioorg Med Chem21:1539-43 (2013) 
 
Carbonic anhydrase 2
Name:Carbonic anhydrase 2
Type:Enzyme
Mol. Mass.:29250.71
Organism:Homo sapiens (Human)
Description:P00918
Residue:260
BDBM50428427
NameBDBM50428427
Synonyms:CHEMBL1098016 | Murralongin
TypeSmall organic molecule
Emp. Form.C15H14O4
Mol. Mass.258.2693
SMILES[#6]-[#8]-c1ccc2ccc(=O)oc2c1\[#6](-[#6]=O)=[#6](\[#6])-[#6]