Reaction Details
TargetCarbonic anhydrase 2
LigandBDBM50428428
Substrate/Competitorn/a
Meas. Tech.ChEMBL_942130 (CHEMBL2341286)
Ki>100000±n/a nM
Citation Davis, RAVullo, DMaresca, ASupuran, CTPoulsen, SA Natural product coumarins that inhibit human carbonic anhydrases. Bioorg Med Chem21:1539-43 (2013) 
 
Carbonic anhydrase 2
Name:Carbonic anhydrase 2
Type:Enzyme
Mol. Mass.:29250.71
Organism:Homo sapiens (Human)
Description:P00918
Residue:260
BDBM50428428
NameBDBM50428428
Synonyms:CHEMBL225024 | Scopolin
TypeSmall organic molecule
Emp. Form.C16H18O9
Mol. Mass.354.3087
SMILESCOc1cc2ccc(=O)oc2cc1O[C@@H]1O[C@H](CO)[C@@H](O)[C@H](O)[C@H]1O