Reaction Details
TargetCarbonic anhydrase 2
LigandBDBM50428430
Substrate/Competitorn/a
Meas. Tech.ChEMBL_942130 (CHEMBL2341286)
Ki>100000±n/a nM
Citation Davis, RAVullo, DMaresca, ASupuran, CTPoulsen, SA Natural product coumarins that inhibit human carbonic anhydrases. Bioorg Med Chem21:1539-43 (2013) 
 
Carbonic anhydrase 2
Name:Carbonic anhydrase 2
Type:Enzyme
Mol. Mass.:29250.71
Organism:Homo sapiens (Human)
Description:P00918
Residue:260
BDBM50428430
NameBDBM50428430
Synonyms:CHEMBL2334351
TypeSmall organic molecule
Emp. Form.C11H10O5
Mol. Mass.222.1941
SMILESCOc1cc2ccc(=O)oc2c(O)c1OC